{"text_format":"1","workbook":"xlsx","n_sheets":12,"sheets":["INSERIMENTO DATI","TAB. per calcolo magg. CC","PROSPETTO DI RIEPILOGO","Tabella A1","Tabella A2","Tabella B1 -B2 - B3","Tabella Standard","PROSP. RIEP. PER VARIANTE","PROSPETTO RATE","PROSPETTO RATE NEW","INFO VERS. E MODIFICHE","Elenchi"],"not_rendered":{"charts":0,"images":15,"macros":1,"external_links":0,"defined_names":10,"comments":0,"pivot_tables":0},"unopened":[],"bounds":{"document_bytes":16777216,"sheet_cells":100000,"rows_first":2000,"rows_last":500,"rows_between":2000,"halvings":0,"cell_chars":16384,"cell_head_chars":4096},"cells_cut":0,"cells_raw":0,"read":"whole","date_system":"1900"}

{"sheet":"INSERIMENTO DATI","index":0,"n_rows":97,"n_cols":26,"rows_kept":97,"cut":false,"hidden":false,"merged":[[98,1,98,15],[1,3,1,15],[3,3,3,15],[5,3,5,15],[7,3,7,15],[10,13,10,15],[36,6,36,15],[41,1,41,13],[43,1,43,13],[49,1,53,1],[56,1,56,3],[63,1,63,15],[42,1,42,13]]}
[]
[null,null,null,"PROSPETTO DI AUTOCALCOLO PER LA DETERMINAZIONE DEL CONTRIBUTO DI COSTRUZIONE ",null,null,null,null,null,null,null,null,null,null,null,null,null,"FLAG"]
[]
[null,"Pratica edilizia",null,null,null,null,null,null,null,null,null,null,null,null,null,null,null,{"$f":"TODAY()","v":"2024-03-27"},null,null,"colore campi editabili"]
[]
[null,"Beneficiario",null,null,null,null,null,null,null,null,null,null,null,null,null,null,null,null,null,null,"R",146]
[]
[null,"Ubicazione ",null,null,null,null,null,null,null,null,null,null,null,null,null,null,null,null,null,null,"V",205]
[null,null,null,null,null,null,null,null,null,null,null,null,null,null,null,null,null,null,null,null,"B",220]
[]
{"$rows_left_out":88}
{"sheet":"TAB. per calcolo magg. CC","index":1,"n_rows":78,"n_cols":14,"rows_kept":78,"cut":false,"hidden":false,"merged":[[20,1,20,2],[1,1,1,8],[15,1,15,2],[16,1,16,2],[17,1,17,2],[18,1,18,2],[19,1,19,2],[14,1,14,3]]}
[]
[null,"TABELLE PER IL CALCOLO DELLA MAGGIORAZIONE DEL COSTO DI COSTRUZIONE"]
[null,null,null,null,null,null,null,null,"Rif. DM 801 del 10 maggio 1977"]
[null,"Pratica edilizia",{"$f":"IF('INSERIMENTO DATI'!D4=\"\",\"\",'INSERIMENTO DATI'!D4)","v":""},null,null,null,null," Campi a compilazione automatica"]
[]
[null,"TAB. 1 - Incremento per superficie utile abitabile"]
[null,"Classe di superficie (mq)","Alloggi (n.ro)","Superficie utile abitabile (mq)","Rapporto Su tot/Su","Incremento (%)",null,null,"Incr.to per classi di superficie \n(%)"]
[null,"<=95","-",{"$f":"'INSERIMENTO DATI'!F50","v":1},{"$f":"IF(D8<>0,ROUNDDOWN(D8/$D$13,2),0)","v":1},0,null,null,{"$f":"ROUNDUP(E8*F8,2)","v":0}]
[null,">95 -> 110","-",{"$f":"'INSERIMENTO DATI'!F51","v":0},{"$f":"IF(D9<>0,ROUNDDOWN(D9/$D$13,2),0)","v":0},5,null,null,{"$f":"ROUNDUP(E9*F9,2)","v":0}]
[null,">110 -> 130","-",{"$f":"'INSERIMENTO DATI'!F52","v":0},{"$f":"IF(D10<>0,ROUNDDOWN(D10/$D$13,2),0)","v":0},15,null,null,{"$f":"ROUNDUP(E10*F10,2)","v":0}]
{"$rows_left_out":69}
{"sheet":"PROSPETTO DI RIEPILOGO","index":2,"n_rows":101,"n_cols":26,"rows_kept":101,"cut":false,"hidden":false,"merged":[[102,1,102,15],[91,4,91,13],[92,4,92,13],[40,5,43,5],[44,5,47,5],[100,2,100,4],[100,6,100,9],[100,13,100,15],[73,5,73,13],[54,1,54,14],[48,5,49,5],[60,5,63,5],[64,5,66,5],[67,5,69,5],[1,4,1,15],[32,1,32,14],[34,1,34,14],[52,1,52,14],[11,1,11,2],[13,1,13,2],[15,1,15,2],[17,1,17,2],[21,5,24,5],[25,5,28,5],[29,5,30,5],[1,1,1,2],[7,1,7,2],[5,1,5,2],[3,1,3,2],[11,6,11,9],[9,4,9,7],[13,4,13,15],[36,5,36,13],[56,5,56,13],[99,13,99,15],[99,2,99,4],[99,6,99,9],[33,1,33,14],[53,1,53,14],[71,1,71,14],[87,5,87,13],[83,5,83,13],[9,1,9,2]]}
[]
[null,null,null,null,"PROSPETTO DI AUTOCALCOLO PER LA DETERMINAZIONE DEL CONTRIBUTO DI COSTRUZIONE "]
[]
[null,"Pratica edilizia",null,null,{"$f":"IF('INSERIMENTO DATI'!D4=0,\"\",'INSERIMENTO DATI'!D4)","v":""}]
[]
[null,"Beneficiario",null,null,{"$f":"IF('INSERIMENTO DATI'!D6=0,\"\",'INSERIMENTO DATI'!D6)","v":""}]
[]
[null,"Ubicazione ",null,null,{"$f":"IF('INSERIMENTO DATI'!D8=0,\"\",'INSERIMENTO DATI'!D8)","v":""}]
[]
[null,"Destinazione di P.R.G.",null,null,{"$f":"IF('INSERIMENTO DATI'!D11=0,\"-\",(IF((AND('INSERIMENTO DATI'!D11=\"Aree ferroviarie destinazione da PRG\",(OR('INSERIMENTO DATI'!N15=\"\",'INSERIMENTO DATI'!D17=\"\"))))=TRUE,\"\",'INSERIMENTO DATI'!D11)))","v":"Centro Storico A1"},null,null,null,null,null,null,"Norma da N.T.A.",null,null,null,{"$f":"'INSERIMENTO DATI'!N11","v":"Art. 45"}]
{"$rows_left_out":92}
{"sheet":"Tabella A1","index":3,"n_rows":54,"n_cols":44,"rows_kept":54,"cut":false,"hidden":true,"merged":[[59,44,65,46],[1,11,2,16],[1,18,1,33],[1,35,1,39],[1,41,53,41],[3,12,6,14],[3,15,6,15],[3,19,3,22],[3,24,3,27],[35,36,40,36],[3,29,3,32],[4,19,4,22],[4,24,4,27],[21,36,21,38],[24,36,32,36],[4,29,4,32],[5,24,5,27],[5,29,5,32],[6,36,6,38],[11,36,16,36],[20,44,27,46],[1,42,53,42],[2,18,2,33],[42,36,47,36],[45,19,45,32],[48,19,48,32],[49,19,49,32],[5,19,5,22]]}
[null,null,null,null,null,null,null,null,null,1,null,3,4,5,6,7,8,9,10,11,12,13,14,15,16,17,18,19,20,21,22,23,24,25]
[null,null,null,null,null,null,null,null,null,null,null,"TABELLA CONTRIBUTO DI COSTRUZIONE A1",null,null,null,null,null,null,"ALIQUOTE URBANIZZAZIONI",null,null,null,null,null,null,null,null,null,null,null,null,null,null,null,null,"ALIQUOTE COSTO DI COSTRUZIONE ",null,null,null,null,null,"AGGIORNAMENTO  21/10/2019","Abbattimenti previsti per le urbanizzazioni primarie e secondarie:\n1) costruzioni sostenibili prot. ITACA: -classe 3 -10%     -classe 4-5 -20%\n2) riqulificazioni e rigenerazione urbana edifici inseriti in piani e programmi complessi di edilizia pubblica e mista con destinazione residenziale  edifici prot. ITACA classe 3 -20%\n3) interventi in area a servizi e verde laddove si tratti di servizi, sportivi e di recupero del disagio sociale -50%"]
[null,null,null,null,null,null,"COEFFICIENTE DI INCREMENTO",1,null,null,null,null,null,null,null,null,null,null,"Tipologia di intervento edilizio"]
[null,null,null,null,null,null,null,null,null,null,null,null,"Destinazione di P.R.G.",null,null,"Norma NTA",null,null,null,"NUOVA COSTRUZIONE",null,null,null,null,"RISTRUTTURAZIONE \ncon\nDemolizione e ricostruzione",null,null,null,null,"RISTRUTTURAZIONE"]
[null,null,null,null,null,null,null,null,null,null,null,null,null,null,null,null,null,null,null,"N.C.",null,null,null,null,"D.R.",null,null,null,null,"R.R."]
["N.C. ",null,null,"D.R.",null,null,"R.R.",null,null,null,null,null,null,null,null,null,null,null,null,"(€/mq)",null,null,null,null,"(€/mq)",null,null,null,null,"(€/mq)"]
["UP","US",null,"UP","US",null,"UP","US",null,"Dest. PRG",null,null,null,null,null,null,null,null,null,"U.P.","U.S.",null,"TOT.",null,"U.P.","U.S.",null,"TOT.",null,"U.P.","U.S.",null,"TOT.",null,null,null,"NUOVE COSTRUZIONI"]
[]
[22.06,45.31,null,22.06,45.31,null,11.03,22.66,null,{"$f":"IF(O9<>\"\",M9&\" \"&N9&\" \"&O9,IF(N9<>\"\",M9&\" \"&N9,M9))","v":"Centro Storico A1"},null,null,"Centro Storico","A1",null,"Art. 45",null,null,null,{"$f":"ROUND(A9*$H$3,2)","v":22.06},{"$f":"ROUND(B9*$H$3,2)","v":45.31},null,{"$f":"T9+U9","v":67.37},null,{"$f":"ROUND(D9*$H$3,2)","v":22.06},{"$f":"ROUND(E9*$H$3,2)","v":45.31},null,{"$f":"Y9+Z9","v":67.37},null,{"$f":"ROUND(G9*$H$3,2)","v":11.03},{"$f":"ROUND(H9*$H$3,2)","v":22.66},null,{"$f":"AD9+AE9","v":33.69}]
[22.06,45.31,null,22.06,45.31,null,11.03,22.66,null,"Interesse Ambientale A2",null,null,"Interesse Ambientale","A2",null,"Art. 46",null,null,null,22.06,45.31,null,67.37,null,22.06,45.31,null,67.37,null,11.03,22.66,null,33.69,null,null,null,"Costruzioni residenziali","€/mq",697.62]
{"$rows_left_out":45}
{"sheet":"Tabella A2","index":4,"n_rows":54,"n_cols":43,"rows_kept":54,"cut":false,"hidden":true,"merged":[[59,44,65,46],[1,11,2,16],[1,18,1,33],[1,35,1,39],[1,41,53,41],[3,12,6,14],[3,15,6,15],[3,19,3,22],[3,24,3,27],[35,36,40,36],[3,29,3,32],[4,19,4,22],[4,24,4,27],[21,36,21,38],[24,36,32,36],[4,29,4,32],[5,24,5,27],[5,29,5,32],[6,36,6,38],[11,36,16,36],[20,44,27,46],[1,42,53,42],[2,18,2,33],[42,36,47,36],[45,19,45,32],[48,19,48,32],[49,19,49,32],[5,19,5,22]]}
[null,null,null,null,null,null,null,null,null,1,null,3,4,5,6,7,8,9,10,11,12,13,14,15,16,17,18,19,20,21,22,23,24,25]
[null,null,null,null,null,null,null,null,null,null,null,"TABELLA CONTRIBUTO DI COSTRUZIONE A2",null,null,null,null,null,null,"ALIQUOTE URBANIZZAZIONI PEEP",null,null,null,null,null,null,null,null,null,null,null,null,null,null,null,null,"ALIQUOTE COSTO DI COSTRUZIONE PEEP",null,null,null,null,null,"AGGIORNAMENTO  21/10/2019","Abbattimenti previsti per le urbanizzazioni primarie e secondarie:\n1) costruzioni sostenibili prot. ITACA: -classe 3 -10%     -classe 4-5 -20%\n2) riqulificazioni e rigenerazione urbana edifici inseriti in piani e programmi complessi di edilizia pubblica e mista con destinazione residenziale  edifici prot. ITACA classe 3 -20%\n3) interventi in area a servizi e verde laddove si tratti di servizi, sportivi e di recupero del disagio sociale -50%"]
[null,null,null,null,null,null,"COEFFICIENTE DI INCREMENTO",1,null,null,null,null,null,null,null,null,null,null,"Tipologia di intervento edilizio"]
[null,null,null,null,null,null,null,null,null,null,null,null,"Destinazione di P.R.G.",null,null,"Norma NTA",null,null,null,"NUOVA COSTRUZIONE",null,null,null,null,"RISTRUTTURAZIONE \ncon\nDemolizione e ricostruzione",null,null,null,null,"RISTRUTTURAZIONE"]
[null,null,null,null,null,null,null,null,null,null,null,null,null,null,null,null,null,null,null,"N.C.",null,null,null,null,"D.R.",null,null,null,null,"R.R."]
["N.C. ",null,null,"D.R.",null,null,"R.R.",null,null,null,null,null,null,null,null,null,null,null,null,"(€/mq)",null,null,null,null,"(€/mq)",null,null,null,null,"(€/mq)"]
["UP","US",null,"UP","US",null,"UP","US",null,"Dest. PRG",null,null,null,null,null,null,null,null,null,"U.P.","U.S.",null,"TOT.",null,"U.P.","U.S.",null,"TOT.",null,"U.P.","U.S.",null,"TOT.",null,null,null,"NUOVE COSTRUZIONI"]
[]
[16.55,33.99,null,16.55,33.99,null,8.27,16.989999999999998,null,{"$f":"IF(O9<>\"\",M9&\" \"&N9&\" \"&O9,IF(N9<>\"\",M9&\" \"&N9,M9))","v":"Centro Storico A1"},null,null,"Centro Storico","A1",null,"Art. 45",null,null,null,{"$f":"ROUND(A9*$H$3,2)","v":16.55},{"$f":"ROUND(B9*$H$3,2)","v":33.99},null,{"$f":"T9+U9","v":50.540000000000006},null,{"$f":"ROUND(D9*$H$3,2)","v":16.55},{"$f":"ROUND(E9*$H$3,2)","v":33.99},null,{"$f":"Y9+Z9","v":50.540000000000006},null,{"$f":"ROUND(G9*$H$3,2)","v":8.27},{"$f":"ROUND(H9*$H$3,2)","v":16.989999999999998},null,{"$f":"AD9+AE9","v":25.259999999999998}]
[16.55,33.9,null,16.55,33.99,null,8.27,16.989999999999998,null,"Interesse Ambientale A2",null,null,"Interesse Ambientale","A2",null,"Art. 46",null,null,null,16.55,33.9,null,50.45,null,16.55,33.99,null,50.540000000000006,null,8.27,16.989999999999998,null,25.259999999999998,null,null,null,"Costruzioni residenziali","€/mq",0]
{"$rows_left_out":45}
{"sheet":"Tabella B1 -B2 - B3","index":5,"n_rows":41,"n_cols":41,"rows_kept":41,"cut":false,"hidden":true,"merged":[[1,14,2,18],[1,20,1,40],[2,20,2,40],[3,15,6,17],[3,21,3,24],[3,26,3,29],[5,21,5,24],[5,26,5,29],[5,31,5,34],[5,36,5,39],[3,31,3,34],[3,36,3,39],[4,21,4,24],[4,26,4,29],[4,31,4,34],[4,36,4,39],[13,14,14,18],[13,20,13,40],[14,20,14,40],[15,15,18,17],[15,21,15,24],[15,26,15,29],[17,21,17,24],[17,26,17,29],[17,31,17,34],[17,36,17,39],[15,31,15,34],[15,36,15,39],[16,21,16,24],[16,26,16,29],[16,31,16,34],[16,36,16,39],[29,21,29,24],[29,26,29,29],[29,31,29,34],[46,42,52,44],[25,14,26,18],[25,20,25,35],[26,20,26,35],[27,15,30,17],[27,21,27,24],[27,26,27,29],[27,31,27,34],[28,21,28,24],[28,26,28,29],[28,31,28,34]]}
[null,null,null,null,null,null,null,null,null,null,null,null,1,2,3,4,5,6,7,8,9,10,11,12,13,14,15,16,17,18,19,20,21,22,23,24,25,26,27,28,29]
[null,null,null,null,null,null,null,null,null,null,null,null,null,null,"TABELLA CONTRIBUTO DI COSTRUZIONE B1",null,null,null,null,null,"ALIQUOTE URBANIZZAZIONI"]
[null,null,null,null,null,null,null,null,null,"COEFFICIENTE DI INCREMENTO",1,null,null,null,null,null,null,null,null,null,"Industrie per il trasferimento di prodotti agricoli, zootecniche, artigianato"]
[null,null,null,null,null,null,null,null,null,null,null,null,"RIFERIMENTO",null,null,"Destinazione di P.R.G.",null,null,null,null,null,"NR. DIPENDENTI",null,null,null,null,"NR. DIPENDENTI",null,null,null,null,"NR. DIPENDENTI",null,null,null,null,"NR. DIPENDENTI"]
[null,null,null,null,null,null,null,null,null,null,null,null,null,null,null,null,null,null,null,null,null,"da 1 a 10",null,null,null,null,"da 11 a 50",null,null,null,null,"da 51 a 200",null,null,null,null,"da 201 a 1000"]
["DA 1 A 10",null,null,"DA 11  A 50",null,null,"DA 51 A 200",null,null,"DA 201  A 1000",null,null,null,null,null,null,null,null,null,null,null,"(€/mq)",null,null,null,null,"(€/mq)",null,null,null,null,"(€/mq)",null,null,null,null,"(€/mq)"]
["UP","US",null,"UP","US",null,"UP","US",null,"UP","US",null,null,null,null,null,null,null,null,null,null,"U.P.","U.S.",null,"TOT.",null,"U.P.","U.S.",null,"TOT.",null,"U.P.","U.S.",null,"TOT.",null,"U.P.","U.S.",null,"TOT."]
[]
[2.04,1.02,null,2.39,1.02,null,2.69,1.02,null,2.92,1.02,null,{"$f":"$U$3&\" - \"&P9","v":"Industrie per il trasferimento di prodotti agricoli, zootecniche, artigianato - Ampliamenti"},null,null,"Ampliamenti",null,null,null,null,null,{"$f":"ROUND(A9*$K$3,2)","v":2.04},1.02,null,{"$f":"V9+W9","v":3.06},null,{"$f":"ROUND(D9*$K$3,2)","v":2.39},1.02,null,{"$f":"AA9+AB9","v":3.41},null,{"$f":"ROUND(G9*$K$3,2)","v":2.69},1.02,null,{"$f":"AF9+AG9","v":3.71},null,{"$f":"ROUND(J9*$K$3,2)","v":2.92},1.02,null,{"$f":"AK9+AL9","v":3.94}]
[3.07,1.53,null,3.59,1.53,null,4.03,1.53,null,4.38,1.53,null,{"$f":"$U$3&\" - \"&P10","v":"Industrie per il trasferimento di prodotti agricoli, zootecniche, artigianato - Nuovi insediamenti"},null,null,"Nuovi insediamenti",null,null,null,null,null,3.07,1.53,null,{"$f":"V10+W10","v":4.5999999999999996},null,3.59,1.53,null,{"$f":"AA10+AB10","v":5.12},null,4.03,1.53,null,{"$f":"AF10+AG10","v":5.5600000000000005},null,4.38,1.53,null,{"$f":"AK10+AL10","v":5.91}]
{"$rows_left_out":32}
{"sheet":"Tabella Standard","index":6,"n_rows":38,"n_cols":7,"rows_kept":38,"cut":false,"hidden":true,"merged":[]}
[]
[null,null,"ZONA","DESCRIZIONE DELLA TIPIZZAZZIONE","Indice di fabbricabilità","Piano casa"]
[null,null,null,null,null,"valore"]
[null,null,null,null,"mc/mq","€ mq"]
["Centro Storico A1",null,"A1","Centro storico",null,{"$f":"F10","v":375},"NELLA TABELLA L'IMPORTO NON INSERITO IN DELIBERA E' STATO ASSIMILATO A ZONA B4 (info da J.Pavone il 20/12/2021)"]
["Interesse Ambientale A2",null,"A2","Area di interesse ambientale",3,{"$f":"F10","v":375},{"$f":"G5","v":"NELLA TABELLA L'IMPORTO NON INSERITO IN DELIBERA E' STATO ASSIMILATO A ZONA B4 (info da J.Pavone il 20/12/2021)"}]
["Completamento B1",null,"B1","Area di completamento",7,1750]
["Completamento B2",null,"B2","Area di completamento",5,1162.5]
["Completamento B3",null,"B3","Area di completamento",3,562.5]
["Completamento B4",null,"B4","Area di completamento",2,375]
{"$rows_left_out":29}
{"sheet":"PROSP. RIEP. PER VARIANTE","index":7,"n_rows":104,"n_cols":24,"rows_kept":104,"cut":false,"hidden":true,"merged":[[54,5,55,7],[56,5,57,7],[96,5,96,7],[97,5,97,7],[95,5,95,7],[73,1,73,16],[74,1,74,16],[59,1,59,16],[60,1,60,16],[61,1,61,16],[69,5,70,7],[66,5,66,7],[67,5,68,7],[63,7,63,15],[105,1,105,17],[90,7,90,15],[100,7,100,15],[75,1,75,16],[77,7,77,15],[88,1,88,16],[83,5,84,7],[85,5,86,7],[81,5,82,7],[80,5,80,7],[1,4,1,20],[1,1,1,2],[3,1,3,2],[5,1,5,2],[7,1,7,2],[3,17,3,20],[42,12,42,20],[23,12,23,17],[32,12,32,17],[36,12,36,17],[9,1,9,2],[9,4,9,9],[11,1,11,2],[13,1,13,2],[13,4,13,17],[15,1,15,2],[17,1,17,2],[21,1,21,9],[53,5,53,7],[30,1,30,9],[42,1,42,9],[24,1,24,2],[27,1,27,2],[26,1,26,3]]}
[]
[null,null,null,null,"PROSPETTO DI AUTOCALCOLO PER LA DETERMINAZIONE DEL CONTRIBUTO DI COSTRUZIONE PER VARIANTE"]
[]
[null,"Pratica edil. attuale in var.",null,null,{"$f":"'PROSPETTO DI RIEPILOGO'!$E$4","v":""},null,null,null,null,null,null,null,null,"Pratica edilizia precedente"]
[]
[null,"Beneficiario",null,null,{"$f":"'PROSPETTO DI RIEPILOGO'!$E$6","v":""}]
[]
[null,"Ubicazione ",null,null,{"$f":"'PROSPETTO DI RIEPILOGO'!$E$8","v":""}]
[]
[null,"Destinazione di P.R.G.",null,null,{"$f":"'PROSPETTO DI RIEPILOGO'!$E$10","v":"Centro Storico A1"},null,null,null,null,null,null,null,null,null,null,null,null,null,"Norma da N.T.A.",null,{"$f":"'PROSPETTO DI RIEPILOGO'!$P$10","v":"Art. 45"}]
{"$rows_left_out":95}
{"sheet":"PROSPETTO RATE","index":8,"n_rows":89,"n_cols":11,"rows_kept":89,"cut":false,"hidden":false,"merged":[[10,5,10,7],[88,2,88,7],[1,2,1,7]]}
[]
[null,null,"PROSPETTO DI CALCOLO IMPORTI DA RATEIZZARE E DA GARANTIRE CON POLIZZE"]
[]
[null,null,"Titolo abilitativo",null,{"$f":"'INSERIMENTO DATI'!D4","v":0}]
[]
[null,null,"Beneficiario",null,{"$f":"IF('INSERIMENTO DATI'!D6=\"\",\"\",'INSERIMENTO DATI'!D6)","v":""}]
[]
[]
[null,null,"SI VUOLE RATEIZZARE L'IMPORTO",null,null,null,null,null,null,null,2]
[]
{"$rows_left_out":80}
{"sheet":"PROSPETTO RATE NEW","index":9,"n_rows":85,"n_cols":11,"rows_kept":85,"cut":false,"hidden":true,"merged":[[1,2,1,7],[10,5,10,7],[84,2,84,7]]}
[]
[null,null,"PROSPETTO DI CALCOLO IMPORTI DA RATEIZZARE E DA GARANTIRE CON POLIZZE"]
[]
[null,null,"Titolo abilitativo",null,{"$f":"'INSERIMENTO DATI'!D4","v":0}]
[]
[null,null,"Beneficiario",null,{"$f":"IF('INSERIMENTO DATI'!D6=\"\",\"\",'INSERIMENTO DATI'!D6)","v":""}]
[]
[]
[null,null,"SI VUOLE RATEIZZARE L'IMPORTO",null,null,null,null,null,null,null,1]
[]
{"$rows_left_out":76}
{"sheet":"INFO VERS. E MODIFICHE","index":10,"n_rows":22,"n_cols":5,"rows_kept":22,"cut":false,"hidden":true,"merged":[]}
["MESE DI EMISSIONE","ANNO EMISSIONE","VERSIONE","DISTRIBUITA","PRINCIPALI MODIFCHE FATTE"]
["MARZO",2020,"01.03","2020-03-06","-"]
["MARZO",2020,"02.03","2020-03-24","Per il cambio d'uso è stata adoperata solo la superficie utile per calcolare il volume da adoperare negli standard escludendo la superficie accessoria."]
["MARZO",2020,"03.03","-","- Per il cambio d'uso per il calcolo del volume da adoperare negli standard è stato applicato un fattore maggiorativo del 30% per tenere conto delle murature esterne ed interne. \n- Alla superficie utile è stato aggiunta anche la superficie accessoria chiusa (escludendo solo logge e balconi).\n- E' stata modificata la scheda d'inserimento cambiando il font in Arial per una maggiore compatibilità.\n- Nel caso di zona di prg A1 ed A2 non considera il calcolo delle autorimesse non essendo previste da NTA."]
["APRILE",2020,"01.04","2020-04-08","- In caso di demolizione e ricostruzione per le urbanizzazioni primarie e secondarie applica la tariffa corretta di DR.\n- Inserito Flag in R28 (in manuale) per verificare che il calcolo dei parcheggi obbligatori della 122/89 sia applicata solo in caso di destinazione residenziale;\n- Inserito controllo nel caso di nuove costruzioni relativo all'inserimento di parcheggi di progetto (controllo in deactivate);"]
["APRILE",2020,"02.04","-","- Nel caso di cambio d'uso per le urbanizzazioni primarie e per le secondarie adopera nel riepilogo la parte relativa alle ristrutturazioni solamente. Per un errore inseriva le superfici anche nella demolizione e ricostruzione."]
["MAGGIO",2020,"01.05","2020-05-04","- Implementato nuvo foglio con prospetto rateizzazione"]
["MAGGIO",2020,"02.05","2020-05-15","- Quando la condizione e' verificata che [Sn+(60% Sa) < 25% Su utilizza sempre il costo di costruzione del residenziale e la tariffa del residenziale."]
["MAGGIO",2020,"03.05","-","- Modifica del calcolo dell'incremento volumetrico percentuale calcolato sul volume senza incremento. Modificata impaginazione del Riepilogo inserendo Su/Sn e Snr/Sa. Modifiche impaginazione e scritte sezione 6 foglio inserimento dati."]
["GIUGNO",2020,"01.06","2020-06-05","Nel caso di cambio d'uso è stato eliminato il calcolo degli standard nel caso di passaggio da residenza a terziario. Sistemata somma Sn nella parte commerciale, mancava l'ultimo rigo. In caso di inserimento di una zona di standard con tariffa nulla lo ripoirta nel prosp. di riepilogo senza che la moltiplicazione dia errore ed il controllo che lo standard non sia inserito funziona essendo il valore nella casella \"Non mon.\" invece che 0. In caso di cambio d'uso inserito il fattore moltiplicativo per passare da netto a lordo da 1,3 a 1,2."]
{"$rows_left_out":13}
{"sheet":"Elenchi","index":11,"n_rows":32,"n_cols":35,"rows_kept":32,"cut":false,"hidden":true,"merged":[]}
["Destinazione di P.R.G.",null,"Distanza dal mare",null,"Incrementi per particolari caratteristiche (modificato e spostato alla fine)",null,"Classe protocollo Itaca",null,"Tipologia attività",null,"Tipo di attività/zona coeff. - ATTIVITA' TURISTICHE","coeff. %",null,"Tipo di attività/zona coeff. - ATTIVITA' COMMERCIALI","coeff. %",null,"Tipo di attività/zona coeff. - ATTIVITA' TERZIARIE","coeff. %",null,"Tipo insediamento",null,"Destinazione di P.R.G.",null,"Articoli NTA PUE ASI",null,"Nr. dipendenti",null,"Standard - Tipizzazione della zona  a standard","ind"," €",null,"Recupero/Ristrutturazioni","flag",null,"Incrementi per particolari caratteristiche"]
["Centro Storico A1","RESIDENZA","<   500 m.",null,0,null,"Inferiore a classe 3 -> Nessuna riduzione Oneri Urb.",null,"Attività turistiche",null,"a. Alberghi 5*",0.1,null,"a. Es. commerciali in genere, negozi ingrosso e dettaglio, supermarket, depositi di merci",0.05,null,"a. Centro edificato coefficiente 5",0.06,null,"Industrie per il trasferimento di prodotti agricoli, zootecniche, artigianato",null,"Ampliamenti",null,"Articolo 9.1",null,"da 1 a 10",null,"Inserimento manuale tariffa (da usare nel caso di media di piu' zone)",null,null,null,"Opere edili semplici",1,null,"1) più di un ascensore per ogni scala se questa serve meno di sei piani sopraelevati"]
["Interesse Ambientale A2","RESIDENZA","< 2000 m.",null,1,null,"Classe 3 -> Riduzione 10% Oneri Urb. Sec.",null,"Attività commerciali",null,"b. Alberghi 4*",0.08,null,"b. Come al punto a. ma nel centro edificato coefficiente 5",0.05,null,"b. Centro edificato coefficiente 6",7.0000000000000007E-2,null,"Industrie non comprese nella tabella B1 - Aree ferroviarie, portuali, aeroportuali",null,"Nuovi insediamenti",null,"Articolo 9.11",null,"da 11 a 50",null,"Centro Storico A1",null,null,null,"Senza opere edili",2,null,"2) scala di servizio non prescritta da leggi o regolamenti o imposta da necessità di prevenzione di infortuni o di incendi"]
["Completamento B1","RESIDENZA","< 5000 m.",null,2,null,"Classe 4/5 -> Riduzione 20% Oneri Urb. Sec.",null,"Attività terziario-direzionale",null,"c. Alberghi 3*",7.0000000000000007E-2,null,"c. Come al punto a. ma nel centro edificato coefficiente 6",0.06,null,"c. Centro edificato coefficiente 7",0.08,null,"Consorzi ASI - Insediamenti commerciali e direzionali",null,"Nuovi insediamenti PP",null,"Articolo 9.2 - 9.3",null,"da 51 a 200",null,"Interesse Ambientale A2",null,null,null,"Con opere edili complesse",3,null,"3) altezza libera netta di piano superiore a m 3,00 o a quella minima prescritta da norme regolamentari. Per ambienti con altezze diverse usare altezza media ponderale"]
["Completamento B2","RESIDENZA","> 5000 m.",null,3,null,null,null,null,null,"d. Alberghi 2* e pensioni",0.05,null,"d. Come al punto a. ma nel centro edificato coefficiente 7",7.0000000000000007E-2,null,"d. Centro edificato coefficiente 8",0.09,null,null,null,null,null,"Articolo 10.3",null,"da 201 a 1000",null,"Completamento B1",7,1750,null,null,null,null,"4) piscina coperta o scoperta quando sia a servizio di uno o più edifici comprendenti meno di 15 unità immobiliari"]
["Completamento B3","RESIDENZA",null,null,4,null,null,null,null,null,"e. Stabilimenti balneari",0.05,null,"e. Come al punto a. ma nel centro edificato coefficiente 8",0.08,null,null,null,null,null,null,null,null,"Articolo 12",null,null,null,"Completamento B2",5,1162.5,null,null,null,null,"5) alloggi di custodia a servizio di uno o più edifici comprendenti meno di 15 unità immobiliari"]
["Completamento B4","RESIDENZA",null,null,5,null,null,null,null,null,"f. Camping posteggi roulotte",0.05,null,"f. Cinema, Teatri, locali di pubblico spettacolo – entro il centro edificato",0.1,null,null,null,null,null,null,null,null,null,null,null,null,"Completamento B3",3,562.5]
["Completamento B5","RESIDENZA",null,null,null,null,null,null,null,null,"g. Ristoranti entro esercizi alberghieri come i rispettivi alberghi",0.05,null,"g. Cinema, Teatri, locali di pubblico spettacolo – fuori il centro edificato",0.06,null,null,null,null,null,null,null,null,null,null,null,null,"Completamento B4",2,375]
["Rinnovamento urbano B6","RESIDENZA",null,null,null,null,null,null,null,null,"h. Ristoranti",7.0000000000000007E-2,null,null,null,null,null,null,null,null,null,null,null,null,null,null,null,"Completamento B5",0.5,93.75]
["Rinnovamento urbano B7","RESIDENZA",null,null,null,null,null,null,null,null,"i. Trattorie e Pizzerie",0.05,null,null,null,null,null,null,null,null,null,null,null,null,null,null,null,"Rinnovamento urbano B6",5,775]
{"$rows_left_out":22}